BDBM339903 US9758480, 114
SMILES CS(=O)(=O)NC(=O)c1cc2cc(NC(=O)[C@@H]3[C@@H](CCN3C(=O)[C@H]3CC[C@@H](CC3)[C@H](N)CF)C3CCCCC3)ccc2[nH]1
InChI Key
Data  1 IC50
  Tab Delimited (TSV)   2D SDfile   Computed 3D by Vconf -m prep SDfile
Find this compound or compounds like it in BindingDB:
Activity Spreadsheet -- Enzyme Inhibition Constant Data from BindingDB
Found 1 hit for monomerid = 339903
TargetCoagulation factor XI(Homo sapiens (Human))
Sumitomo Dainippon Pharma
US Patent
LigandPNGBDBM339903(US9758480, 114)
Affinity DataIC50:  7nM. Assay description: 0.35 μg/mL human FXIa was allowed to react with a substrate and a test compound in a 30 mmol/L HEPES buffer solution (pH 7.4) that contained 145...
Ligand InfoPC cidPC sid
In DepthDetails US Patent