BDBM339986 5-{[(3S,4S)-4-amino-1,1- dioxidotetrahydro-2H- thiopyran-3-yl]amino}-3- (5-chloro-1H-indol-2- yl)pyrazine-2- carboxamide::US9775839, 7.10
SMILES N[C@H]1CCS(=O)(=O)C[C@H]1Nc1cnc(C(N)=O)c(n1)-c1cc2cc(Cl)ccc2[nH]1
InChI Key
Data  1 IC50
  Tab Delimited (TSV)   2D SDfile   Computed 3D by Vconf -m prep SDfile
Find this compound or compounds like it in BindingDB:
Activity Spreadsheet -- Enzyme Inhibition Constant Data from BindingDB
Found 1 hit for monomerid = 339986
TargetTyrosine-protein kinase SYK(Homo sapiens (Human))
Merck Sharp & Dohme
US Patent
LigandPNGBDBM339986(5-{[(3S,4S)-4-amino-1,1- dioxidotetrahydro-2H- thi...)
Affinity DataIC50:  1.20nM. Assay description: A recombinant GST-hSYK fusion protein was used to measure potency of compounds to inhibit human Syk activity. The recombinant human GST-SYK (Carna Bi...
Ligand InfoPC cidPC sid
In DepthDetails US Patent