BDBM340041 2-(5-Methoxy-2-methyl-2H-indazol-3-yl)-1H-pyrrolo[3,2-b]pyridine-7-carboxylic acid::US10231957, Example 2::US9758517, Example 2
SMILES COc1ccc2nn(C)c(-c3cc4nccc(C(O)=O)c4[nH]3)c2c1
InChI Key InChIKey=AOVIOXUIFLZHIH-UHFFFAOYSA-N
Data  1 IC50
  Tab Delimited (TSV)   2D SDfile   Computed 3D by Vconf -m prep SDfile
Find this compound or compounds like it in BindingDB:
Activity Spreadsheet -- Enzyme Inhibition Constant Data from BindingDB
Found 1 hit for monomerid = 340041
TargetLysine-specific demethylase 4C(Homo sapiens (Human))
Celgene Quanticel Research
US Patent
LigandPNGBDBM340041(2-(5-Methoxy-2-methyl-2H-indazol-3-yl)-1H-pyrrolo[...)
Affinity DataIC50:  550nM. Assay description: The ability of test compounds to inhibit the activity of JMJD2C was determined in 384-well plate format under the following reaction conditions: 0.3 ...
Ligand InfoPC cidPC sid
In DepthDetails US Patent