BDBM340053 2-(1-Methyl-1H-indazol-3-yl)-1H-pyrrolo[3,2-b]pyridine-7-carboxylic acid::US10231957, Example 13::US9758517, Example 13
SMILES Cn1nc(-c2cc3nccc(C(O)=O)c3[nH]2)c2ccccc12
InChI Key InChIKey=YMNGPJXGHYXUBI-UHFFFAOYSA-N
Data  1 IC50
  Tab Delimited (TSV)   2D SDfile   Computed 3D by Vconf -m prep SDfile
Find this compound or compounds like it in BindingDB:
Activity Spreadsheet -- Enzyme Inhibition Constant Data from BindingDB
Found 1 hit for monomerid = 340053
TargetLysine-specific demethylase 4C(Homo sapiens (Human))
Celgene Quanticel Research
US Patent
LigandPNGBDBM340053(2-(1-Methyl-1H-indazol-3-yl)-1H-pyrrolo[3,2-b]pyri...)
Affinity DataIC50:  550nM. Assay description: The ability of test compounds to inhibit the activity of JMJD2C was determined in 384-well plate format under the following reaction conditions: 0.3 ...
Ligand InfoPC cidPC sid
In DepthDetails US Patent