BDBM340167 (S,E)-4-(8-amino-3-(1-(4- (dimethylamino)-N-methylbut-2- enamido)ethyl)imidazo[1,5- a]pyrazin-1-yl)-N-(4-propylpyridin- 2-yl)benzamide::US10239883, Example 76::US10934296, Example 76::US9758524, Example 76
SMILES CCCc1ccnc(NC(=O)c2ccc(cc2)-c2nc([C@H](C)N(C)C(=O)\C=C\CN(C)C)n3ccnc(N)c23)c1
InChI Key InChIKey=GBQKMMIHFOYLQO-JCOOBLOPSA-N
Data  15 EC50
  Tab Delimited (TSV)   2D SDfile   Computed 3D by Vconf -m prep SDfile
Find this compound or compounds like it in BindingDB:
Activity Spreadsheet -- Enzyme Inhibition Constant Data from BindingDB
Found 15 hits for monomerid = 340167
TargetTyrosine-protein kinase BTK(Homo sapiens (Human))
Merck Sharp & Dohme
US Patent
LigandPNGBDBM340167((S,E)-4-(8-amino-3-(1-(4- (dimethylamino)-N-methyl...)
Affinity DataEC50: <10nM. Assay description: Btk enzyme (His-Btk (Millipore catalog #14-552), is diluted to 0.4 U/mL in KR buffer (10 mM Tris-HCl, 10 mM MgCl2, 0.01% Tween-20, 0.05% NaN3, 1 mM D...
Ligand InfoPC cidPC sid
In DepthDetails US Patent
TargetTyrosine-protein kinase Lck(Homo sapiens (Human))
Merck Sharp & Dohme
US Patent
LigandPNGBDBM340167((S,E)-4-(8-amino-3-(1-(4- (dimethylamino)-N-methyl...)
Affinity DataEC50:  550nM. Assay description: Lck enzyme activity is measured using the IMAP (immobilized metal ion affinity-based fluorescence polarization) assay as outlined below.Lck enzyme (M...
Ligand InfoPC cidPC sid
In DepthDetails US Patent
TargetProto-oncogene tyrosine-protein kinase Src(Homo sapiens (Human))
Merck Sharp & Dohme
US Patent
LigandPNGBDBM340167((S,E)-4-(8-amino-3-(1-(4- (dimethylamino)-N-methyl...)
Affinity DataEC50: >1.00E+3nM. Assay description: Src enzyme activity is measured using the IMAP (immobilized metal ion affinity-based fluorescence polarization) assay as outlined below.Src enzyme (M...
Ligand InfoPC cidPC sid
In DepthDetails US Patent
TargetTyrosine-protein kinase Fyn(Homo sapiens (Human))
Merck Sharp & Dohme
US Patent
LigandPNGBDBM340167((S,E)-4-(8-amino-3-(1-(4- (dimethylamino)-N-methyl...)
Affinity DataEC50: >1.00E+3nM. Assay description: FynT enzyme activity is measured using the IMAP (immobilized metal ion affinity-based fluorescence polarization) assay as outlined below.FynT enzyme ...
Ligand InfoPC cidPC sid
In DepthDetails US Patent
TargetTyrosine-protein kinase Lyn(Homo sapiens (Human))
Merck Sharp & Dohme
US Patent
LigandPNGBDBM340167((S,E)-4-(8-amino-3-(1-(4- (dimethylamino)-N-methyl...)
Affinity DataEC50: >1.00E+3nM. Assay description: Lyn enzyme activity is measured using the IMAP (immobilized metal ion affinity-based fluorescence polarization) assay as outlined below.Lyn enzyme (M...
Ligand InfoPC cidPC sid
In DepthDetails US Patent
TargetTyrosine-protein kinase BTK(Homo sapiens (Human))
Merck Sharp & Dohme
US Patent
LigandPNGBDBM340167((S,E)-4-(8-amino-3-(1-(4- (dimethylamino)-N-methyl...)
Affinity DataEC50: <10nM. Assay description: Btk enzyme (His-Btk (Millipore catalog #14-552), is diluted to 0.4 U/mL in KR buffer (10 mM Tris-HCl, 10 mM MgCl2, 0.01% Tween-20, 0.05% NaN3, 1 mM D...
Ligand InfoPC cidPC sid
In DepthDetails US Patent
TargetTyrosine-protein kinase Lck(Homo sapiens (Human))
Merck Sharp & Dohme
US Patent
LigandPNGBDBM340167((S,E)-4-(8-amino-3-(1-(4- (dimethylamino)-N-methyl...)
Affinity DataEC50:  550nM. Assay description: Lck enzyme (Millipore catalog #14-442), is diluted to 0.4 U/mL in KR buffer (10 mM Tris-HCl, 10 mM MgCl2, 0.01% Tween-20, 0.05% NaN3, 1 mM DTT, 2 mM ...
Ligand InfoPC cidPC sid
In DepthDetails US Patent
TargetProto-oncogene tyrosine-protein kinase Src(Homo sapiens (Human))
Merck Sharp & Dohme
US Patent
LigandPNGBDBM340167((S,E)-4-(8-amino-3-(1-(4- (dimethylamino)-N-methyl...)
Affinity DataEC50: >1.00E+3nM. Assay description: Src enzyme (Millipore catalog #14-326), is diluted to 0.8 U/mL in KR buffer (10 mM Tris-HCl, 10 mM MgCl2, 0.01% Tween-20, 0.05% NaN3, 1 mM DTT, 2 mM ...
Ligand InfoPC cidPC sid
In DepthDetails US Patent
TargetTyrosine-protein kinase Fyn(Homo sapiens (Human))
Merck Sharp & Dohme
US Patent
LigandPNGBDBM340167((S,E)-4-(8-amino-3-(1-(4- (dimethylamino)-N-methyl...)
Affinity DataEC50: >1.00E+3nM. Assay description: FynT enzyme (Biomol catalog #SE-287), is diluted to 0.5 μg/mL in KR buffer (10 mM Tris-HCl, 10 mM MgCl2, 0.01% Tween-20, 0.05% NaN3, 1 mM DTT, 2...
Ligand InfoPC cidPC sid
In DepthDetails US Patent
TargetTyrosine-protein kinase Lyn(Homo sapiens (Human))
Merck Sharp & Dohme
US Patent
LigandPNGBDBM340167((S,E)-4-(8-amino-3-(1-(4- (dimethylamino)-N-methyl...)
Affinity DataEC50: >1.00E+3nM. Assay description: Lyn enzyme (Millipore catalog #14-510), is diluted to 250 mU/mL in KR buffer (10 mM Tris-HCl, 10 mM MgCl2, 0.01% Tween-20, 0.05% NaN3, 1 mM DTT, 2 mM...
Ligand InfoPC cidPC sid
In DepthDetails US Patent
TargetProto-oncogene tyrosine-protein kinase Src(Homo sapiens (Human))
Merck Sharp & Dohme
US Patent
LigandPNGBDBM340167((S,E)-4-(8-amino-3-(1-(4- (dimethylamino)-N-methyl...)
Affinity DataEC50: >1.00E+3nM. Assay description: Src enzyme activity is measured using the IMAP (immobilized metal ion affinity-based fluorescence polarization) assay as outlined below.Src enzyme (M...
Ligand InfoPC cidPC sid
In DepthDetails US Patent
TargetTyrosine-protein kinase Fyn(Homo sapiens (Human))
Merck Sharp & Dohme
US Patent
LigandPNGBDBM340167((S,E)-4-(8-amino-3-(1-(4- (dimethylamino)-N-methyl...)
Affinity DataEC50: >1.00E+3nM. Assay description: FynT enzyme activity is measured using the IMAP (immobilized metal ion affinity-based fluorescence polarization) assay as outlined below.FynT enzyme ...
Ligand InfoPC cidPC sid
In DepthDetails US Patent
TargetTyrosine-protein kinase Lyn(Homo sapiens (Human))
Merck Sharp & Dohme
US Patent
LigandPNGBDBM340167((S,E)-4-(8-amino-3-(1-(4- (dimethylamino)-N-methyl...)
Affinity DataEC50: >1.00E+3nM. Assay description: Lyn enzyme activity is measured using the IMAP (immobilized metal ion affinity-based fluorescence polarization) assay as outlined below.Lyn enzyme (M...
Ligand InfoPC cidPC sid
In DepthDetails US Patent
TargetTyrosine-protein kinase BTK(Homo sapiens (Human))
Merck Sharp & Dohme
US Patent
LigandPNGBDBM340167((S,E)-4-(8-amino-3-(1-(4- (dimethylamino)-N-methyl...)
Affinity DataEC50: <10nM. Assay description: Btk enzyme activity is measured using the IMAP (immobilized metal ion affinity-based fluorescence polarization) assay as outlined below.Btk enzyme (H...
Ligand InfoPC cidPC sid
In DepthDetails US Patent
TargetTyrosine-protein kinase Lck(Homo sapiens (Human))
Merck Sharp & Dohme
US Patent
LigandPNGBDBM340167((S,E)-4-(8-amino-3-(1-(4- (dimethylamino)-N-methyl...)
Affinity DataEC50:  550nM. Assay description: Lck enzyme activity is measured using the IMAP (immobilized metal ion affinity-based fluorescence polarization) assay as outlined below.Lck enzyme (M...
Ligand InfoPC cidPC sid
In DepthDetails US Patent