BDBM340207 3-((2S,4R)-2-(5-(3- chlorophenyl)-1H- imidazol-2-yl)-4- fluoropyrrolidine-1- carboxamido)-1H- indole-1-carboxamide::US9758537, Compound 10
SMILES NC(=O)n1cc(NC(=O)N2C[C@H](F)C[C@H]2c2ncc([nH]2)-c2cccc(Cl)c2)c2ccccc12
InChI Key
Data  1 IC50
  Tab Delimited (TSV)   2D SDfile   Computed 3D by Vconf -m prep SDfile
Find this compound or compounds like it in BindingDB:
Activity Spreadsheet -- Enzyme Inhibition Constant Data from BindingDB
Found 1 hit for monomerid = 340207
TargetComplement factor D(Homo sapiens (Human))
Achillion Pharmaceuticals
US Patent
LigandPNGBDBM340207(3-((2S,4R)-2-(5-(3- chlorophenyl)-1H- imidazol-2-y...)
Affinity DataIC50:  5.50E+3nM. Assay description: Human factor D (purified from human serum, Complement Technology, Inc.) at 80 nM final concentration is incubated with test compound at various conce...
Ligand InfoPC cidPC sid
In DepthDetails US Patent