BDBM340208 2-(3-acetyl-1H-indol-1- yl)-1-((2S,4R)-2-(5-(3- chlorophenyl)-1H- imidazol-2-yl)-4- fluoropyrrolidin-1- yl)ethanone::US9758537, Compound 11
SMILES CC(=O)c1cn(CC(=O)N2C[C@H](F)C[C@H]2c2ncc([nH]2)-c2cccc(Cl)c2)c2ccccc12
InChI Key
Data  1 IC50
  Tab Delimited (TSV)   2D SDfile   Computed 3D by Vconf -m prep SDfile
Find this compound or compounds like it in BindingDB:
Activity Spreadsheet -- Enzyme Inhibition Constant Data from BindingDB
Found 1 hit for monomerid = 340208
TargetComplement factor D(Homo sapiens (Human))
Achillion Pharmaceuticals
US Patent
LigandPNGBDBM340208(2-(3-acetyl-1H-indol-1- yl)-1-((2S,4R)-2-(5-(3- ch...)
Affinity DataIC50: >1.00E+4nM. Assay description: Human factor D (purified from human serum, Complement Technology, Inc.) at 80 nM final concentration is incubated with test compound at various conce...
Ligand InfoPC cidPC sid
In DepthDetails US Patent