BDBM340240 (2S,4R)-1-(2-(3-acetyl- 1H-indol-1-yl)acetyl)- N-(2,3-dihydro-1H- inden-2-yl)-4- fluoropyrrolidine-2- carboxamide::US9758537, Compound 43
SMILES CC(=O)c1cn(CC(=O)N2C[C@H](F)C[C@H]2C(=O)NC2Cc3ccccc3C2)c2ccccc12
InChI Key InChIKey=VMWJEICCKDVRSL-DVECYGJZSA-N
Data  1 IC50
  Tab Delimited (TSV)   2D SDfile   Computed 3D by Vconf -m prep SDfile
Find this compound or compounds like it in BindingDB:
Activity Spreadsheet -- Enzyme Inhibition Constant Data from BindingDB
Found 1 hit for monomerid = 340240
TargetComplement factor D(Homo sapiens (Human))
Achillion Pharmaceuticals
US Patent
LigandPNGBDBM340240((2S,4R)-1-(2-(3-acetyl- 1H-indol-1-yl)acetyl)- N-(...)
Affinity DataIC50: <1.00E+3nM. Assay description: Human factor D (purified from human serum, Complement Technology, Inc.) at 80 nM final concentration is incubated with test compound at various conce...
Ligand InfoPC cidPC sid
In DepthDetails US Patent