BDBM340243 (2S,4R)-N-(3-chloro-2- fluorobenzyl)-4-fluoro- 1-(2-(3-nitro-1H-indol- 1-yl)acetyl)pyrrolidine- 2-carboxamide::US9758537, Compound 46
SMILES [O-][N+](=O)c1cn(CC(=O)N2C[C@H](F)C[C@H]2C(=O)NCc2cccc(Cl)c2F)c2ccccc12
InChI Key InChIKey=OUYSVHNWRRHPDV-KDOFPFPSSA-N
Data  1 IC50
  Tab Delimited (TSV)   2D SDfile   Computed 3D by Vconf -m prep SDfile
Find this compound or compounds like it in BindingDB:
Activity Spreadsheet -- Enzyme Inhibition Constant Data from BindingDB
Found 1 hit for monomerid = 340243
TargetComplement factor D(Homo sapiens (Human))
Achillion Pharmaceuticals
US Patent
LigandPNGBDBM340243((2S,4R)-N-(3-chloro-2- fluorobenzyl)-4-fluoro- 1-(...)
Affinity DataIC50: <1.00E+3nM. Assay description: Human factor D (purified from human serum, Complement Technology, Inc.) at 80 nM final concentration is incubated with test compound at various conce...
Ligand InfoPC cidPC sid
In DepthDetails US Patent