BDBM340256 US9758537, Compound 59::diethyl 3-((2S,4R)-1-(2- (3-acetyl-1H-indol-1- yl)acetyl)-4- fluoropyrrolidine-2- carboxamido)-5- chlorophenylphosphonate
SMILES CCOP(=O)(OCC)c1cc(Cl)cc(NC(=O)[C@@H]2C[C@@H](F)CN2C(=O)Cn2cc(C(C)=O)c3ccccc23)c1
InChI Key InChIKey=DQBFNKXEPVTOIM-CLOONOSVSA-N
Data  1 IC50
  Tab Delimited (TSV)   2D SDfile   Computed 3D by Vconf -m prep SDfile
Find this compound or compounds like it in BindingDB:
Activity Spreadsheet -- Enzyme Inhibition Constant Data from BindingDB
Found 1 hit for monomerid = 340256
TargetComplement factor D(Homo sapiens (Human))
Achillion Pharmaceuticals
US Patent
LigandPNGBDBM340256(US9758537, Compound 59 | diethyl 3-((2S,4R)-1-(2- ...)
Affinity DataIC50:  5.50E+3nM. Assay description: Human factor D (purified from human serum, Complement Technology, Inc.) at 80 nM final concentration is incubated with test compound at various conce...
Ligand InfoPC cidPC sid
In DepthDetails US Patent