BDBM340257 US9758537, Compound 60::ethyl hydrogen 1-(2- ((2S,4R)-2-(3-chloro-2- fluorobenzylcarbamoyl)- 4-fluoropyrrolidin-1- yl)-2-oxoethyl)-1H- pyrazolo[3,4-e]pyridin- 3-ylphosphonate
SMILES CCOP(O)(=O)c1nn(CC(=O)N2C[C@H](F)C[C@H]2C(=O)NCc2cccc(Cl)c2F)c2cnccc12
InChI Key InChIKey=WWONLSYBCZLADB-PBHICJAKSA-N
Data  1 IC50
  Tab Delimited (TSV)   2D SDfile   Computed 3D by Vconf -m prep SDfile
Find this compound or compounds like it in BindingDB:
Activity Spreadsheet -- Enzyme Inhibition Constant Data from BindingDB
Found 1 hit for monomerid = 340257
TargetComplement factor D(Homo sapiens (Human))
Achillion Pharmaceuticals
US Patent
LigandPNGBDBM340257(US9758537, Compound 60 | ethyl hydrogen 1-(2- ((2S...)
Affinity DataIC50:  5.50E+3nM. Assay description: Human factor D (purified from human serum, Complement Technology, Inc.) at 80 nM final concentration is incubated with test compound at various conce...
Ligand InfoPC cidPC sid
In DepthDetails US Patent