BDBM340260 3-(((2S,4R)-1-(2-(3- acetyl-1H-indol-1- yl)acetyl)-4- fluoropyrrolidine-2- carboxamido)methyl)-5- chloro-4- fluorophenylphosphonic acid::US9758537, Compound 63
SMILES CC(=O)c1cn(CC(=O)N2C[C@H](F)C[C@H]2C(=O)NCc2cc(cc(Cl)c2F)P(O)(O)=O)c2ccccc12
InChI Key InChIKey=AEVAYACGKNORDD-VFNWGFHPSA-N
Data  1 IC50
  Tab Delimited (TSV)   2D SDfile   Computed 3D by Vconf -m prep SDfile
Find this compound or compounds like it in BindingDB:
Activity Spreadsheet -- Enzyme Inhibition Constant Data from BindingDB
Found 1 hit for monomerid = 340260
TargetComplement factor D(Homo sapiens (Human))
Achillion Pharmaceuticals
US Patent
LigandPNGBDBM340260(3-(((2S,4R)-1-(2-(3- acetyl-1H-indol-1- yl)acetyl)...)
Affinity DataIC50: <1.00E+3nM. Assay description: Human factor D (purified from human serum, Complement Technology, Inc.) at 80 nM final concentration is incubated with test compound at various conce...
Ligand InfoPC cidPC sid
In DepthDetails US Patent