BDBM340304 1-(2-((2S,4R)-2-(5'- acetyl-2'-chloro-2- fluorobiphenyl-3- ylcarbamoyl)-4- fluoropyrrolidin-1-yl)- 2-oxoethyl)-1H- indazole-3-carboxamide::US9758537, Compound 117
SMILES CC(=O)c1ccc(Cl)c(c1)-c1cccc(NC(=O)[C@@H]2C[C@@H](F)CN2C(=O)Cn2nc(C(N)=O)c3ccccc23)c1F
InChI Key InChIKey=YIELGQWMRFJJEK-OSPHWJPCSA-N
Data  1 IC50
  Tab Delimited (TSV)   2D SDfile   Computed 3D by Vconf -m prep SDfile
Find this compound or compounds like it in BindingDB:
Activity Spreadsheet -- Enzyme Inhibition Constant Data from BindingDB
Found 1 hit for monomerid = 340304
TargetComplement factor D(Homo sapiens (Human))
Achillion Pharmaceuticals
US Patent
LigandPNGBDBM340304(1-(2-((2S,4R)-2-(5'- acetyl-2'-chloro-2- fluorobip...)
Affinity DataIC50: <1.00E+3nM. Assay description: Human factor D (purified from human serum, Complement Technology, Inc.) at 80 nM final concentration is incubated with test compound at various conce...
Ligand InfoPC cidPC sid
In DepthDetails US Patent