BDBM340333 US9758538, Example 21
SMILES C[C@H]1COCCN1c1nc(N[C@@]2(C)CCN(C2)C(C)=O)cc(n1)-c1cnc(N)nc1
InChI Key InChIKey=YBEGUSZLSLVGRW-RBZFPXEDSA-N
Data  1 KI
  Tab Delimited (TSV)   2D SDfile   Computed 3D by Vconf -m prep SDfile
Find this compound or compounds like it in BindingDB:
Activity Spreadsheet -- Enzyme Inhibition Constant Data from BindingDB
Found 1 hit for monomerid = 340333
TargetPhosphatidylinositol 3-kinase regulatory subunit alpha(Homo sapiens (Human))
Pfizer
US Patent
LigandPNGBDBM340333(US9758538, Example 21)
Affinity DataKi:  0.605nM. Assay description: The biochemical assays of kinase activity of full-length PI3Kα (full-length p110α/p85α) or truncated PI3Kα (p110α/iSH2 p85&#...
Ligand InfoPC cidPC sid
In DepthDetails US Patent