BDBM34037 phenylpropanoic acid derivative, 76
SMILES CC(=O)N(Cc1nc(oc1C)-c1ccccc1)Cc1ccc(C[C@@H](C(O)=O)n2cccc2)cc1
InChI Key InChIKey=QWVMMWLVLYZWJO-VWLOTQADSA-N
Data  1 IC50  2 EC50
  Tab Delimited (TSV)   2D SDfile   Computed 3D by Vconf -m prep SDfile
Find this compound or compounds like it in BindingDB:
Activity Spreadsheet -- Enzyme Inhibition Constant Data from BindingDB
Found 2 hits for monomerid = 34037
TargetPeroxisome proliferator-activated receptor alpha(Homo sapiens (Human))
Novartis
LigandPNGBDBM34037(phenylpropanoic acid derivative, 76)
Affinity DataEC50: >3.00E+4nMT: 2°C. Assay description: Human PPAR alpha receptor was expressed as recombinant glutathione-S-transferase (GST)-fusion proteins in Escherichia coli. The purified GST-hPPAR al...
In DepthDetails ArticlePubMed
TargetPeroxisome proliferator-activated receptor gamma(Homo sapiens (Human))
Pfizer
LigandPNGBDBM34037(phenylpropanoic acid derivative, 76)
Affinity DataIC50: >1.00E+5nM EC50: >3.00E+4nMpH: 7.4 T: 2°C. Assay description: Human 6His-PPAR gamma ligand-binding domain was added to the mixture containing radioligand and test compound, followed by yttrium silicate polylysin...
In DepthDetails ArticlePubMed