BDBM340406 US9758538, Example 94
SMILES CC[C@]1(CCN(C1)C(=O)C1(F)CC1)Nc1cc(nc(n1)N1CCOCC1)-c1cnc(N)nc1
InChI Key InChIKey=YPFZCNCMEFWIET-OAQYLSRUSA-N
Data  1 KI
  Tab Delimited (TSV)   2D SDfile   Computed 3D by Vconf -m prep SDfile
Find this compound or compounds like it in BindingDB:
Activity Spreadsheet -- Enzyme Inhibition Constant Data from BindingDB
Found 1 hit for monomerid = 340406
TargetPhosphatidylinositol 3-kinase regulatory subunit alpha(Homo sapiens (Human))
Pfizer
US Patent
LigandPNGBDBM340406(US9758538, Example 94)
Affinity DataKi:  0.631nM. Assay description: The biochemical assays of kinase activity of full-length PI3Kα (full-length p110α/p85α) or truncated PI3Kα (p110α/iSH2 p85&#...
Ligand InfoPC cidPC sid
In DepthDetails US Patent