BDBM340421 US9758538, Example 109
SMILES CC(C)(N)C(=O)N1CC[C@@](C)(C1)Nc1nc(nc(c1F)-c1cnc(N)nc1)N1CCOCC1
InChI Key InChIKey=VRDWTMGQKWISOH-NRFANRHFSA-N
Data  1 KI
  Tab Delimited (TSV)   2D SDfile   Computed 3D by Vconf -m prep SDfile
Find this compound or compounds like it in BindingDB:
Activity Spreadsheet -- Enzyme Inhibition Constant Data from BindingDB
Found 1 hit for monomerid = 340421
TargetPhosphatidylinositol 3-kinase regulatory subunit alpha(Homo sapiens (Human))
Pfizer
US Patent
LigandPNGBDBM340421(US9758538, Example 109)
Affinity DataKi:  0.0930nM. Assay description: The biochemical assays of kinase activity of full-length PI3Kα (full-length p110α/p85α) or truncated PI3Kα (p110α/iSH2 p85&#...
Ligand InfoPC cidPC sid
In DepthDetails US Patent