BDBM340768 1-(5-(1-Phenylallyl)-4-propoxy-2′-(1H-tetrazol-5-yl)-[1,1′-biphenyl]-3-yl)-3-(p-tolyl)urea::US9765018, Example 8
SMILES CCCOc1c(NC(=O)Nc2ccc(C)cc2)cc(cc1C(C=C)c1ccccc1)-c1ccccc1-c1nnn[nH]1
InChI Key
Data  1 IC50
  Tab Delimited (TSV)   2D SDfile   Computed 3D by Vconf -m prep SDfile
Find this compound or compounds like it in BindingDB:
Activity Spreadsheet -- Enzyme Inhibition Constant Data from BindingDB
Found 1 hit for monomerid = 340768
TargetIndoleamine 2,3-dioxygenase 1(Homo sapiens (Human))
Bristol-Myers Squibb
US Patent
LigandPNGBDBM340768(1-(5-(1-Phenylallyl)-4-propoxy-2′-(1H-tetraz...)
Affinity DataIC50:  30nM. Assay description: Human IDO1/HEK293 cells were seeded at 10,000 cells per 50 uL per well with RPMI/phenol red free media contains 10% FBS in a 384-well black wall clea...
Ligand InfoPC cidPC sid
In DepthDetails US Patent