BDBM340804 4'-(2- cyclopropylphenoxy)-4- methoxy-3'-(3-p- tolylureido)biphenyl-3- carboxylic acid::US9765018, Example 127
SMILES COc1ccc(cc1C(O)=O)-c1ccc(Oc2ccccc2C2CC2)c(NC(=O)Nc2ccc(C)cc2)c1
InChI Key InChIKey=RXJGSALLONISNF-UHFFFAOYSA-N
Data  1 IC50
  Tab Delimited (TSV)   2D SDfile   Computed 3D by Vconf -m prep SDfile
Find this compound or compounds like it in BindingDB:
Activity Spreadsheet -- Enzyme Inhibition Constant Data from BindingDB
Found 1 hit for monomerid = 340804
TargetIndoleamine 2,3-dioxygenase 1(Homo sapiens (Human))
Bristol-Myers Squibb
US Patent
LigandPNGBDBM340804(4'-(2- cyclopropylphenoxy)-4- methoxy-3'-(3-p- tol...)
Affinity DataIC50:  3.29E+3nM. Assay description: Human IDO1/HEK293 cells were seeded at 10,000 cells per 50 uL per well with RPMI/phenol red free media contains 10% FBS in a 384-well black wall clea...
Ligand InfoPC cidPC sid
In DepthDetails US Patent