BDBM340839 US9765018, Example 313
SMILES CCCC(Oc1ccc(cc1NC(=O)Nc1ccc(C)cc1)-c1ccccc1-c1nnn[nH]1)c1ccccc1Cl
InChI Key
Data  1 IC50
  Tab Delimited (TSV)   2D SDfile   Computed 3D by Vconf -m prep SDfile
Find this compound or compounds like it in BindingDB:
Activity Spreadsheet -- Enzyme Inhibition Constant Data from BindingDB
Found 1 hit for monomerid = 340839
TargetIndoleamine 2,3-dioxygenase 1(Homo sapiens (Human))
Bristol-Myers Squibb
US Patent
LigandPNGBDBM340839(US9765018, Example 313)
Affinity DataIC50:  610nM. Assay description: Human IDO1/HEK293 cells were seeded at 10,000 cells per 50 uL per well with RPMI/phenol red free media contains 10% FBS in a 384-well black wall clea...
Ligand InfoPC cidPC sid
In DepthDetails US Patent