BDBM340850 US9765054, Compound 25C
SMILES ONC(=O)[C@@H]1[C@@H]([C@H]1c1cncnc1)c1ccccc1
InChI Key InChIKey=LRIWEJZWXQCFNI-JHJVBQTASA-N
Data  1 IC50
  Tab Delimited (TSV)   2D SDfile   Computed 3D by Vconf -m prep SDfile
Find this compound or compounds like it in BindingDB:
Activity Spreadsheet -- Enzyme Inhibition Constant Data from BindingDB
Found 1 hit for monomerid = 340850
TargetHistone deacetylase 4(Homo sapiens (Human))
Chdi Foundation
US Patent
LigandPNGBDBM340850(US9765054, Compound 25C)
Affinity DataIC50:  1.81E+3nM. Assay description: 5 μl of each solution of 1:20 diluted compound from above is transferred to a clear bottomed, black, 384-well assay plate using the Bravo or the...
Ligand InfoPC cidPC sid
In DepthDetails US Patent