BDBM340893 US9765054, Compound 60
SMILES Cn1ccnc1-c1ccc(cc1)[C@H]1[C@@H]([C@@H]1c1ccccc1)C(=O)NO
InChI Key InChIKey=GBGPACXMYDEVFM-KZNAEPCWSA-N
Data  1 IC50
  Tab Delimited (TSV)   2D SDfile   Computed 3D by Vconf -m prep SDfile
Find this compound or compounds like it in BindingDB:
Activity Spreadsheet -- Enzyme Inhibition Constant Data from BindingDB
Found 1 hit for monomerid = 340893
TargetHistone deacetylase 4(Homo sapiens (Human))
Chdi Foundation
US Patent
LigandPNGBDBM340893(US9765054, Compound 60)
Affinity DataIC50:  290nM. Assay description: 5 μl of each solution of 1:20 diluted compound from above is transferred to a clear bottomed, black, 384-well assay plate using the Bravo or the...
Ligand InfoPC cidPC sid
In DepthDetails US Patent