BDBM340894 3-(3-(2-chlorobenzyloxy)phenyl)-1-isopropyl-1H- pyrazolo[3,4-d]pyrimidin-4-amine::US10544104, Compound 21::US11247972, Compound 21::US9765037, Compound 21
SMILES CC(C)n1nc(-c2cccc(OCc3ccccc3Cl)c2)c2c(N)ncnc12
InChI Key InChIKey=UMUDKYDOMRFISB-UHFFFAOYSA-N
Data  6 IC50
  Tab Delimited (TSV)   2D SDfile   Computed 3D by Vconf -m prep SDfile
Find this compound or compounds like it in BindingDB:
Activity Spreadsheet -- Enzyme Inhibition Constant Data from BindingDB
Found 6 hits for monomerid = 340894
TargetCalmodulin-domain protein kinase 1(Toxoplasma gondii)
University Of Washington Through Its Center For Commercialization
US Patent
LigandPNGBDBM340894(3-(3-(2-chlorobenzyloxy)phenyl)-1-isopropyl-1H- py...)
Affinity DataIC50: >3.00E+3nM. Assay description: Most known kinase inhibitors bind in the ATP-binding pocket of the active site19,20. These inhibitors exploit many of the same hydrophobic contacts a...
Ligand InfoPC cidPC sid
In DepthDetails US Patent
TargetCalcium-dependent protein kinase 1(Cryptosporidium parvum)
University Of Washington Through Its Center For Commercialization
US Patent
LigandPNGBDBM340894(3-(3-(2-chlorobenzyloxy)phenyl)-1-isopropyl-1H- py...)
Affinity DataIC50: >3.00E+3nM. Assay description: Two types of enzyme assays were developed to follow TgCDPK1 activity, a radiometric scintillation proximity assay measured the labeled γ-phospha...
Ligand InfoPC cidPC sid
In DepthDetails US Patent
TargetCalcium/calmodulin dependent protein kinase with a kinas domain and 4 calmodulin-like EF hands(Cryptosporidium parvum (strain Iowa II))
University Of Washington Through Its Center For Commercialization
US Patent
LigandPNGBDBM340894(3-(3-(2-chlorobenzyloxy)phenyl)-1-isopropyl-1H- py...)
Affinity DataIC50: >3.00E+3nM. Assay description: Inhibition of TgCDPK1 and CpCDPK1 was determined using a luminescent kinase assay which measures ATP depletion in the presence of the Syntide 2 pepti...
Ligand InfoPC cidPC sid
In DepthDetails US Patent
TargetCalmodulin-domain protein kinase 1, putative(Cryptosporidium parvum (strain Iowa II))
University Of Washington Through Its Center For
US Patent
LigandPNGBDBM340894(3-(3-(2-chlorobenzyloxy)phenyl)-1-isopropyl-1H- py...)
Affinity DataIC50: >3.00E+3nM. Assay description: Inhibition of TgCDPK1 and CpCDPK1 was determined using a luminescent kinase assay which measures ATP depletion in the presence of the Syntide 2 pepti...
Ligand InfoPC cidPC sid
In DepthDetails US Patent
TargetcGMP-dependent protein kinase()
University Of Washington Through Its Center For Commercialization
US Patent
LigandPNGBDBM340894(3-(3-(2-chlorobenzyloxy)phenyl)-1-isopropyl-1H- py...)
Affinity DataIC50: >3.00E+3nM. Assay description: Inhibition of TgCDPK1 and CpCDPK1 was determined using a luminescent kinase assay which measures ATP depletion in the presence of the Syntide 2 pepti...
Ligand InfoPC cidPC sid
In DepthDetails US Patent
TargetCalmodulin-domain protein kinase 1(Toxoplasma gondii)
University Of Washington Through Its Center For Commercialization
US Patent
LigandPNGBDBM340894(3-(3-(2-chlorobenzyloxy)phenyl)-1-isopropyl-1H- py...)
Affinity DataIC50: >3.00E+3nM. Assay description: Inhibition of TgCDPK1 and CpCDPK1 was determined using a luminescent kinase assay which measures ATP depletion in the presence of the Syntide 2 pepti...
Ligand InfoPC cidPC sid
In DepthDetails US Patent