BDBM341011 1-(5-Chloro-2-{[(3S)-3-[(4-methylpiperazin-1-yl)methyl]-3,4-dihydroisoquinolin-2(1H)-yl]carbonyl}phenyl)-N-(4-fluorophenyl)-N-(4-hydroxyphenyl)-5-methyl-1H-pyrrole-3-carboxamide::US9765056, Example 66
SMILES CN1CCN(C[C@@H]2Cc3ccccc3CN2C(=O)c2ccc(Cl)cc2-n2cc(cc2C)C(=O)N(c2ccc(O)cc2)c2ccc(F)cc2)CC1
InChI Key InChIKey=SQKWTNKFCWTIPM-DHUJRADRSA-N
Data  1 IC50
  Tab Delimited (TSV)   2D SDfile   Computed 3D by Vconf -m prep SDfile
Find this compound or compounds like it in BindingDB:
Activity Spreadsheet -- Enzyme Inhibition Constant Data from BindingDB
Found 1 hit for monomerid = 341011
TargetApoptosis regulator Bcl-2(Homo sapiens (Human))
Les Laboratoires Servier
US Patent
LigandPNGBDBM341011(1-(5-Chloro-2-{[(3S)-3-[(4-methylpiperazin-1-yl)me...)
Affinity DataIC50:  6.60nM. Assay description: Method A:The fluorescence polarisation tests were carried out on microplates (384 wells). The Bcl-2 protein, labelled (histag-Bcl-2 such that Bcl-2 c...
Ligand InfoPC cidPC sid
In DepthDetails US Patent