BDBM341035 5-Chloro-N-(4-hydroxyphenyl)-N-(1H-indol-5-yl)-1-(6-{[(3S)-3-[(4-methylpiperazin-1-yl)methyl]-3,4-dihydroisoquinolin-2(1H)-yl]carbonyl}-1,3-benzodioxol-5-yl)-1H-indole-3-carboxamide::US9765056, Example 88
SMILES CN1CCN(C[C@@H]2Cc3ccccc3CN2C(=O)c2cc3OCOc3cc2-n2cc(C(=O)N(c3ccc(O)cc3)c3ccc4[nH]ccc4c3)c3cc(Cl)ccc23)CC1
InChI Key InChIKey=SPRXJEGNACEUGY-DHUJRADRSA-N
Data  1 IC50
  Tab Delimited (TSV)   2D SDfile   Computed 3D by Vconf -m prep SDfile
Find this compound or compounds like it in BindingDB:
Activity Spreadsheet -- Enzyme Inhibition Constant Data from BindingDB
Found 1 hit for monomerid = 341035
TargetApoptosis regulator Bcl-2(Homo sapiens (Human))
Les Laboratoires Servier
US Patent
LigandPNGBDBM341035(5-Chloro-N-(4-hydroxyphenyl)-N-(1H-indol-5-yl)-1-(...)
Affinity DataIC50:  19.6nM. Assay description: Method A:The fluorescence polarisation tests were carried out on microplates (384 wells). The Bcl-2 protein, labelled (histag-Bcl-2 such that Bcl-2 c...
Ligand InfoPC cidPC sid
In DepthDetails US Patent