BDBM341094 1-{6-[(3S)-3-(Aminomethyl)-1,2,3,4-tetrahydroisoquinoline-2-carbonyl]-2-(2-methylpropyl)-2H-1,3-benzodioxol-5-yl}-N-(4-hydroxyphenyl)-N-phenyl-1H-indole-3-carboxamide::US9765056, Example 158
SMILES CC(C)CC1Oc2cc(C(=O)N3Cc4ccccc4C[C@H]3CN)c(cc2O1)-n1cc(C(=O)N(c2ccccc2)c2ccc(O)cc2)c2ccccc12
InChI Key InChIKey=IJYJOGKLBRIZRK-IROIYFLTSA-N
Data  1 IC50
  Tab Delimited (TSV)   2D SDfile   Computed 3D by Vconf -m prep SDfile
Find this compound or compounds like it in BindingDB:
Activity Spreadsheet -- Enzyme Inhibition Constant Data from BindingDB
Found 1 hit for monomerid = 341094
TargetApoptosis regulator Bcl-2(Homo sapiens (Human))
Les Laboratoires Servier
US Patent
LigandPNGBDBM341094(1-{6-[(3S)-3-(Aminomethyl)-1,2,3,4-tetrahydroisoqu...)
Affinity DataIC50:  54.1nM. Assay description: Method A:The fluorescence polarisation tests were carried out on microplates (384 wells). The Bcl-2 protein, labelled (histag-Bcl-2 such that Bcl-2 c...
Ligand InfoPC cidPC sid
In DepthDetails US Patent