BDBM341113 1-{4-Hydroxy-5-methoxy-2-[(3S)-3-[(4-methylpiperazin-1-yl)methyl]-1,2,3,4-tetrahydroisoquinoline-2-carbonyl]phenyl}-N,N-diphenyl-1H-indole-3-carboxamide dihydrochloride::US9765056, Example 181
SMILES COc1cc(c(cc1O)C(=O)N1Cc2ccccc2C[C@H]1CN1CCN(C)CC1)-n1cc(C(=O)N(c2ccccc2)c2ccccc2)c2ccccc12
InChI Key InChIKey=XTDQACDZTHCWLA-DHUJRADRSA-N
Data  1 IC50
  Tab Delimited (TSV)   2D SDfile   Computed 3D by Vconf -m prep SDfile
Find this compound or compounds like it in BindingDB:
Activity Spreadsheet -- Enzyme Inhibition Constant Data from BindingDB
Found 1 hit for monomerid = 341113
TargetApoptosis regulator Bcl-2(Homo sapiens (Human))
Les Laboratoires Servier
US Patent
LigandPNGBDBM341113(1-{4-Hydroxy-5-methoxy-2-[(3S)-3-[(4-methylpiperaz...)
Affinity DataIC50:  6.90nM. Assay description: Method A:The fluorescence polarisation tests were carried out on microplates (384 wells). The Bcl-2 protein, labelled (histag-Bcl-2 such that Bcl-2 c...
Ligand InfoPC cidPC sid
In DepthDetails US Patent