BDBM341127 N,N-Dibutyl-1-{2-[(3S)-3-[(4-methylpiperazin-1-yl)methyl]-1,2,3,4-tetrahydroisoquinoline-2-carbonyl]-4-[2-(phenylsulphanyl)acetamido]phenyl}-1H-indole-3-carboxamide::US9765056, Example 199
SMILES CCCCN(CCCC)C(=O)c1cn(-c2ccc(NC(=O)CSc3ccccc3)cc2C(=O)N2Cc3ccccc3C[C@H]2CN2CCN(C)CC2)c2ccccc12
InChI Key InChIKey=OXDOPXGPUDLCAA-LHEWISCISA-N
Data  1 IC50
  Tab Delimited (TSV)   2D SDfile   Computed 3D by Vconf -m prep SDfile
Find this compound or compounds like it in BindingDB:
Activity Spreadsheet -- Enzyme Inhibition Constant Data from BindingDB
Found 1 hit for monomerid = 341127
TargetApoptosis regulator Bcl-2(Homo sapiens (Human))
Les Laboratoires Servier
US Patent
LigandPNGBDBM341127(N,N-Dibutyl-1-{2-[(3S)-3-[(4-methylpiperazin-1-yl)...)
Affinity DataIC50:  57.7nM. Assay description: Method A:The fluorescence polarisation tests were carried out on microplates (384 wells). The Bcl-2 protein, labelled (histag-Bcl-2 such that Bcl-2 c...
Ligand InfoPC cidPC sid
In DepthDetails US Patent