BDBM341137 US9765057, 4
SMILES COC(=O)c1c(SC)ccnc1O[C@@H]1CC[C@@H](C)N(C1)C(=O)c1ccccc1-c1ncccn1
InChI Key InChIKey=INHZIRBRJLHYCI-IAGOWNOFSA-N
Data  2 IC50
  Tab Delimited (TSV)   2D SDfile   Computed 3D by Vconf -m prep SDfile
Find this compound or compounds like it in BindingDB:
Activity Spreadsheet -- Enzyme Inhibition Constant Data from BindingDB
Found 2 hits for monomerid = 341137
TargetOrexin/Hypocretin receptor type 1(Homo sapiens (Human))
Merck Sharp & Dohme
US Patent
LigandPNGBDBM341137(US9765057, 4)
Affinity DataIC50:  554nM. Assay description: FLIPR Ca2+ Flux Assay (Okumura et al., Biochem. Biophys. Res. Comm. 280:976-981, 2001). In a typical experiment the OX1 and OX2 receptor antagonistic...
Ligand InfoPC cidPC sid
In DepthDetails US Patent
TargetOrexin receptor type 2(Homo sapiens (Human))
Merck Sharp & Dohme
US Patent
LigandPNGBDBM341137(US9765057, 4)
Affinity DataIC50:  28.3nM. Assay description: FLIPR Ca2+ Flux Assay (Okumura et al., Biochem. Biophys. Res. Comm. 280:976-981, 2001). In a typical experiment the OX1 and OX2 receptor antagonistic...
Ligand InfoPC cidPC sid
In DepthDetails US Patent