BDBM341235 (S)-4-((1-(5-(3-(2-oxa-6-azaspiro[3.3]heptan-6-yl)propyl)-4-oxo-3-phenyl-3,4-dihydroquinazolin-2-yl)ethyl)amino)-2,6-diaminopyrimidine-5-carbonitrile ::US9765060, Compound 62
SMILES C[C@H](Nc1nc(N)nc(N)c1C#N)c1nc2cccc(CCCN3CC4(COC4)C3)c2c(=O)n1-c1ccccc1
InChI Key InChIKey=XTNPMHGEXROTSP-SFHVURJKSA-N
Data  1 IC50
  Tab Delimited (TSV)   2D SDfile   Computed 3D by Vconf -m prep SDfile
Find this compound or compounds like it in BindingDB:
Activity Spreadsheet -- Enzyme Inhibition Constant Data from BindingDB
Found 1 hit for monomerid = 341235
TargetPhosphatidylinositol 4,5-bisphosphate 3-kinase catalytic subunit delta isoform(Homo sapiens (Human))
Gilead Sciences
US Patent
LigandPNGBDBM341235((S)-4-((1-(5-(3-(2-oxa-6-azaspiro[3.3]heptan-6-yl)...)
Affinity DataIC50:  0.800nM. Assay description: TR-FRET monitored the formation of 3,4,5-inositol triphosphate molecule that competed with fluorescently labeled PIP3 for binding to the GRP-1 plecks...
Ligand InfoPC cidPC sid
In DepthDetails US Patent