BDBM341271 (S)-4-amino-6-((1-(5-chloro-4-oxo-3-phenyl-3,4-dihydroquinazolin-2-yl)ethyl)amino)-2-methylpyrimidine-5-carbonitrile ::US9765060, Compound 98
SMILES C[C@H](Nc1nc(C)nc(N)c1C#N)c1nc2cccc(Cl)c2c(=O)n1-c1ccccc1
InChI Key InChIKey=HQZOOVIDFNMEIC-LBPRGKRZSA-N
Data  1 IC50
  Tab Delimited (TSV)   2D SDfile   Computed 3D by Vconf -m prep SDfile
Find this compound or compounds like it in BindingDB:
Activity Spreadsheet -- Enzyme Inhibition Constant Data from BindingDB
Found 1 hit for monomerid = 341271
TargetPhosphatidylinositol 4,5-bisphosphate 3-kinase catalytic subunit delta isoform(Homo sapiens (Human))
Gilead Sciences
US Patent
LigandPNGBDBM341271((S)-4-amino-6-((1-(5-chloro-4-oxo-3-phenyl-3,4-dih...)
Affinity DataIC50:  10nM. Assay description: TR-FRET monitored the formation of 3,4,5-inositol triphosphate molecule that competed with fluorescently labeled PIP3 for binding to the GRP-1 plecks...
Ligand InfoPC cidPC sid
In DepthDetails US Patent