BDBM341277 6-({2-[4-(5-Chloro-2-cyanophenyl)-5-methoxy-2-oxopyridin-1(2H)-yl]-3-cyclobutylpropanoyl}-amino)imidazo[1,2-a]pyridine-2-carboxylic acid (racemate)::US9765070, Example 5
SMILES COc1cn(C(CC2CCC2)C(=O)Nc2ccc3nc(cn3c2)C(O)=O)c(=O)cc1-c1cc(Cl)ccc1C#N
InChI Key InChIKey=QPLOFYKBIFMXBX-UHFFFAOYSA-N
Data  2 IC50
  Tab Delimited (TSV)   2D SDfile   Computed 3D by Vconf -m prep SDfile
Find this compound or compounds like it in BindingDB:
Activity Spreadsheet -- Enzyme Inhibition Constant Data from BindingDB
Found 2 hits for monomerid = 341277
TargetPlasma kallikrein(Homo sapiens (Human))
Bayer Pharma Aktiengesellschaft
US Patent
LigandPNGBDBM341277(6-({2-[4-(5-Chloro-2-cyanophenyl)-5-methoxy-2-oxop...)
Affinity DataIC50:  7.10nM. Assay description: Test substances are dissolved in dimethyl sulphoxide and serially diluted in dimethyl sulphoxide (3000 μM to 0.0078 μM; resulting final con...
Ligand InfoPC cidPC sid
In DepthDetails US Patent
TargetCoagulation factor XI(Homo sapiens (Human))
Bayer Pharma Aktiengesellschaft
US Patent
LigandPNGBDBM341277(6-({2-[4-(5-Chloro-2-cyanophenyl)-5-methoxy-2-oxop...)
Affinity DataIC50:  1nM. Assay description: Test substances are dissolved in dimethyl sulphoxide and serially diluted in dimethyl sulphoxide (3000 μM to 0.0078 μM; resulting final con...
Ligand InfoPC cidPC sid
In DepthDetails US Patent