BDBM341307 N-(3-Butyl[1,2,4]triazolo[4,3-a]pyridin-6-yl)-2-[4-(5-chloro-2-cyanophenyl)-5-methoxy-2-oxopyridin-1(2H)-yl]-4-methoxybutanamide (racemate)::US9765070, Example 24
SMILES CCCCc1nnc2ccc(NC(=O)C(CCOC)n3cc(OC)c(cc3=O)-c3cc(Cl)ccc3C#N)cn12
InChI Key InChIKey=RFWCJQGHDAKRMA-UHFFFAOYSA-N
Data  2 IC50
  Tab Delimited (TSV)   2D SDfile   Computed 3D by Vconf -m prep SDfile
Find this compound or compounds like it in BindingDB:
Activity Spreadsheet -- Enzyme Inhibition Constant Data from BindingDB
Found 2 hits for monomerid = 341307
TargetPlasma kallikrein(Homo sapiens (Human))
Bayer Pharma Aktiengesellschaft
US Patent
LigandPNGBDBM341307(N-(3-Butyl[1,2,4]triazolo[4,3-a]pyridin-6-yl)-2-[4...)
Affinity DataIC50:  16nM. Assay description: Test substances are dissolved in dimethyl sulphoxide and serially diluted in dimethyl sulphoxide (3000 μM to 0.0078 μM; resulting final con...
Ligand InfoPC cidPC sid
In DepthDetails US Patent
TargetCoagulation factor XI(Homo sapiens (Human))
Bayer Pharma Aktiengesellschaft
US Patent
LigandPNGBDBM341307(N-(3-Butyl[1,2,4]triazolo[4,3-a]pyridin-6-yl)-2-[4...)
Affinity DataIC50:  63nM. Assay description: Test substances are dissolved in dimethyl sulphoxide and serially diluted in dimethyl sulphoxide (3000 μM to 0.0078 μM; resulting final con...
Ligand InfoPC cidPC sid
In DepthDetails US Patent