BDBM341316 2-[5-Chloro-4-(5-chloro-2-cyanophenyl)-2-oxopyridin-1(2H)-yl]-N-(imidazo[1,2-a]pyridin-6-yl)-3-(1,3-oxazol-4-yl)propanamide (racemate)::US9765070, Example 33
SMILES Clc1ccc(C#N)c(c1)-c1cc(=O)n(cc1Cl)C(Cc1cocn1)C(=O)Nc1ccc2nccn2c1
InChI Key InChIKey=RMMLZVAGUQRCKX-UHFFFAOYSA-N
Data  2 IC50
  Tab Delimited (TSV)   2D SDfile   Computed 3D by Vconf -m prep SDfile
Find this compound or compounds like it in BindingDB:
Activity Spreadsheet -- Enzyme Inhibition Constant Data from BindingDB
Found 2 hits for monomerid = 341316
TargetPlasma kallikrein(Homo sapiens (Human))
Bayer Pharma Aktiengesellschaft
US Patent
LigandPNGBDBM341316(2-[5-Chloro-4-(5-chloro-2-cyanophenyl)-2-oxopyridi...)
Affinity DataIC50:  250nM. Assay description: Test substances are dissolved in dimethyl sulphoxide and serially diluted in dimethyl sulphoxide (3000 μM to 0.0078 μM; resulting final con...
Ligand InfoPC cidPC sid
In DepthDetails US Patent
TargetCoagulation factor XI(Homo sapiens (Human))
Bayer Pharma Aktiengesellschaft
US Patent
LigandPNGBDBM341316(2-[5-Chloro-4-(5-chloro-2-cyanophenyl)-2-oxopyridi...)
Affinity DataIC50:  310nM. Assay description: Test substances are dissolved in dimethyl sulphoxide and serially diluted in dimethyl sulphoxide (3000 μM to 0.0078 μM; resulting final con...
Ligand InfoPC cidPC sid
In DepthDetails US Patent