BDBM34134 2,5-dibenzylbenzene-1,4-diol, 6a
SMILES Oc1cc(Cc2ccccc2)c(O)cc1Cc1ccccc1
InChI Key InChIKey=KLTAEGHKPHCULT-UHFFFAOYSA-N
Data  1 IC50
  Tab Delimited (TSV)   2D SDfile   Computed 3D by Vconf -m prep SDfile
Find this compound or compounds like it in BindingDB:
Activity Spreadsheet -- Enzyme Inhibition Constant Data from BindingDB
Found 1 hit for monomerid = 34134
TargetSarcoplasmic/endoplasmic reticulum calcium ATPase 1(Oryctolagus cuniculus)
Northern Kentucky University
LigandPNGBDBM34134(2,5-dibenzylbenzene-1,4-diol, 6a)
Affinity DataIC50:  9.40E+3nMpH: 7.3 T: 2°C. Assay description: Inhibitory potencies of compounds were determined in a coupled ATPase activity assay using SERCA microsomes at 14 different inhibitor concentrations....
In DepthDetails ArticlePubMed