BDBM341934 US9771320, Example 168
SMILES Fc1ccc(cc1)S(=O)(=O)[C@]1(CC[C@@H](C1)C(=O)N1CCOCC1)c1ccc(cc1)C(OCc1c(F)cccc1F)(C(F)(F)F)C(F)(F)F
InChI Key InChIKey=ATABWDXZYZIADQ-WRONEBCDSA-N
Data  1 IC50
  Tab Delimited (TSV)   2D SDfile   Computed 3D by Vconf -m prep SDfile
Find this compound or compounds like it in BindingDB:
Activity Spreadsheet -- Enzyme Inhibition Constant Data from BindingDB
Found 1 hit for monomerid = 341934
TargetNuclear receptor ROR-gamma(Homo sapiens (Human))
Bristol-Myers Squibb
US Patent
LigandPNGBDBM341934(US9771320, Example 168)
Affinity DataIC50:  49nM. Assay description: The binding of potential ligands to RORγ is measured by competition with [3H] 25-hydroxycholesterol (Perkin Elmer NET674250UC) using a scintilla...
Ligand InfoPC cidPC sid
In DepthDetails US Patent