BDBM342118 N-((4-(3-chlorophenyl)-2-(trifluoromethyl)oxazol-5-yl)methyl)-2-(4-((sulfamoylamino)methyl)-phenyl)propanamide::US9771359, EX-05
SMILES CC(C(=O)NCc1oc(nc1-c1cccc(Cl)c1)C(F)(F)F)c1ccc(CNS(N)(=O)=O)cc1
InChI Key InChIKey=JUGDQVAHZZKOTF-UHFFFAOYSA-N
Data  1 KI
  Tab Delimited (TSV)   2D SDfile   Computed 3D by Vconf -m prep SDfile
Find this compound or compounds like it in BindingDB:
Activity Spreadsheet -- Enzyme Inhibition Constant Data from BindingDB
Found 1 hit for monomerid = 342118
TargetTransient receptor potential cation channel subfamily V member 1(Homo sapiens (Human))
Medifron Dbt
US Patent
LigandPNGBDBM342118(N-((4-(3-chlorophenyl)-2-(trifluoromethyl)oxazol-5...)
Affinity DataKi:  7.5nM. Assay description: The FLIPR protocol consists of 2 substance additions during a kinetic measurement. First the compounds to be tested (5 μM) are pipetted onto the...
Ligand InfoPC cidPC sid
In DepthDetails US Patent