BDBM342181 4-[4-[4-[5-(4-fluorophenyl)-4-methyl- 1H-imidazol-2-yl]-1-piperidyl]-7H- pyrrolo[2,3-d]pyrimidin-6- yl]benzonitrile::US9771369, Compound P-3020
SMILES Cc1nc([nH]c1-c1ccc(F)cc1)C1CCN(CC1)c1ncnc2[nH]c(cc12)-c1ccc(cc1)C#N
InChI Key InChIKey=NFOHSLJQGZYJLZ-UHFFFAOYSA-N
Data  2 KI
  Tab Delimited (TSV)   2D SDfile   Computed 3D by Vconf -m prep SDfile
Find this compound or compounds like it in BindingDB:
Activity Spreadsheet -- Enzyme Inhibition Constant Data from BindingDB
Found 2 hits for monomerid = 342181
TargetMast/stem cell growth factor receptor Kit [D816V](Homo sapiens (Human))
Plexxikon
US Patent
LigandPNGBDBM342181(4-[4-[4-[5-(4-fluorophenyl)-4-methyl- 1H-imidazol-...)
Affinity DataKi:  500nM. Assay description: The c-kit mutant D816V (or kinase domain thereof) is an active kinase in AlphaScreen. IC50 values are determined with respect to inhibition of c-Kit ...
Ligand InfoPC cidPC sid
In DepthDetails US Patent
TargetMast/stem cell growth factor receptor Kit(Homo sapiens (Human))
Plexxikon
US Patent
LigandPNGBDBM342181(4-[4-[4-[5-(4-fluorophenyl)-4-methyl- 1H-imidazol-...)
Affinity DataKi:  5.50E+3nM. Assay description: Assays for biochemical cell-based activity of c-kit kinase are known in the art, for example, as described in U.S. Pat. Nos. 7,498,342 and 7,846,941,...
Ligand InfoPC cidPC sid
In DepthDetails US Patent