BDBM342468 US10329299, Compound 37::US10675286, Compound 37::US11541059, Compound 37::US9775844, Compound 37
SMILES C[C@H](NC(=O)c1c(N)nn2cccnc12)c1cc2cccc(C#Cc3c(C)nn(C)c3C)c2c(=O)n1-c1ccccc1
InChI Key InChIKey=QHYTYFXSSMJYJF-FQEVSTJZSA-N
Data  18 IC50
  Tab Delimited (TSV)   2D SDfile   Computed 3D by Vconf -m prep SDfile
Find this compound or compounds like it in BindingDB:
Activity Spreadsheet -- Enzyme Inhibition Constant Data from BindingDB
Found 18 hits for monomerid = 342468
TargetPhosphatidylinositol 4,5-bisphosphate 3-kinase catalytic subunit alpha isoform(Homo sapiens (Human))
Infinity Pharmaceuticals
US Patent
LigandPNGBDBM342468(US10329299, Compound 37 | US10675286, Compound 37 ...)
Affinity DataIC50:  2.00E+3nM. Assay description: Class I PI3-Ks can be either purchased (p110α/p85α, p110β/p85α, p110δ/p85α from Upstate, and p110γ from Sigma) or ...
Ligand InfoPC cidPC sid
In DepthDetails US Patent
TargetPhosphatidylinositol 4,5-bisphosphate 3-kinase catalytic subunit gamma isoform(Homo sapiens (Human))
Infinity Pharmaceuticals
US Patent
LigandPNGBDBM342468(US10329299, Compound 37 | US10675286, Compound 37 ...)
Affinity DataIC50:  3.00E+3nM. Assay description: PI3 Kinase α, β, γ or δ activity was assayed using the PI3 Kinase HTRF® assay kit (catalogue No. 33-016) purchased from Millipore...
Ligand InfoPC cidPC sid
In DepthDetails US Patent
TargetPhosphatidylinositol 4,5-bisphosphate 3-kinase catalytic subunit gamma isoform(Homo sapiens (Human))
Infinity Pharmaceuticals
US Patent
LigandPNGBDBM342468(US10329299, Compound 37 | US10675286, Compound 37 ...)
Affinity DataIC50:  2.00E+3nM. Assay description: Class I PI3-Ks can be either purchased (p110α/p85α, p110β/p85α, p110δ/p85α from Upstate, and p110γ from Sigma) or ...
Ligand InfoPC cidPC sid
In DepthDetails US Patent
TargetPhosphatidylinositol 4,5-bisphosphate 3-kinase catalytic subunit delta isoform(Homo sapiens (Human))
Infinity Pharmaceuticals
US Patent
LigandPNGBDBM342468(US10329299, Compound 37 | US10675286, Compound 37 ...)
Affinity DataIC50:  3.00E+3nM. Assay description: Class I PI3-Ks can be either purchased (p110α/p85α, p110β/p85α, p110δ/p85α from Upstate, and p110γ from Sigma) or ...
Ligand InfoPC cidPC sid
In DepthDetails US Patent
TargetPhosphatidylinositol 4,5-bisphosphate 3-kinase catalytic subunit alpha isoform(Homo sapiens (Human))
Infinity Pharmaceuticals
US Patent
LigandPNGBDBM342468(US10329299, Compound 37 | US10675286, Compound 37 ...)
Affinity DataIC50:  2.00E+3nM. Assay description: A PI3-Kinase HTRF® assay kit (cat No. 33-016) purchased from Millipore Corporation was used to screen compounds provided herein. This assay used spec...
Ligand InfoPC cidPC sid
In DepthDetails US Patent
TargetPhosphatidylinositol 4,5-bisphosphate 3-kinase catalytic subunit beta isoform(Homo sapiens (Human))
Infinity Pharmaceuticals
US Patent
LigandPNGBDBM342468(US10329299, Compound 37 | US10675286, Compound 37 ...)
Affinity DataIC50:  2.00E+3nM. Assay description: A PI3-Kinase HTRF® assay kit (cat No. 33-016) purchased from Millipore Corporation was used to screen compounds provided herein. This assay used spec...
Ligand InfoPC cidPC sid
In DepthDetails US Patent
TargetPhosphatidylinositol 4,5-bisphosphate 3-kinase catalytic subunit gamma isoform(Homo sapiens (Human))
Infinity Pharmaceuticals
US Patent
LigandPNGBDBM342468(US10329299, Compound 37 | US10675286, Compound 37 ...)
Affinity DataIC50:  2.00E+3nM. Assay description: A PI3-Kinase HTRF® assay kit (cat No. 33-016) purchased from Millipore Corporation was used to screen compounds provided herein. This assay used spec...
Ligand InfoPC cidPC sid
In DepthDetails US Patent
TargetPhosphatidylinositol 4,5-bisphosphate 3-kinase catalytic subunit delta isoform(Homo sapiens (Human))
Infinity Pharmaceuticals
US Patent
LigandPNGBDBM342468(US10329299, Compound 37 | US10675286, Compound 37 ...)
Affinity DataIC50:  3.00E+3nM. Assay description: A PI3-Kinase HTRF® assay kit (cat No. 33-016) purchased from Millipore Corporation was used to screen compounds provided herein. This assay used spec...
Ligand InfoPC cidPC sid
In DepthDetails US Patent
TargetPhosphatidylinositol 4,5-bisphosphate 3-kinase catalytic subunit alpha isoform(Homo sapiens (Human))
Infinity Pharmaceuticals
US Patent
LigandPNGBDBM342468(US10329299, Compound 37 | US10675286, Compound 37 ...)
Affinity DataIC50:  2.00E+3nM. Assay description: A PI3-Kinase HTRF® assay kit (cat No. 33-016) purchased from Millipore Corporation was used to screen compounds provided herein. This assay used spec...
Ligand InfoPC cidPC sid
In DepthDetails US Patent
TargetPhosphatidylinositol 4,5-bisphosphate 3-kinase catalytic subunit beta isoform(Homo sapiens (Human))
Infinity Pharmaceuticals
US Patent
LigandPNGBDBM342468(US10329299, Compound 37 | US10675286, Compound 37 ...)
Affinity DataIC50:  2.00E+3nM. Assay description: A PI3-Kinase HTRF® assay kit (cat No. 33-016) purchased from Millipore Corporation was used to screen compounds provided herein. This assay used spec...
Ligand InfoPC cidPC sid
In DepthDetails US Patent
TargetPhosphatidylinositol 4,5-bisphosphate 3-kinase catalytic subunit delta isoform(Homo sapiens (Human))
Infinity Pharmaceuticals
US Patent
LigandPNGBDBM342468(US10329299, Compound 37 | US10675286, Compound 37 ...)
Affinity DataIC50:  2.00E+3nM. Assay description: A PI3-Kinase HTRF® assay kit (cat No. 33-016) purchased from Millipore Corporation was used to screen compounds provided herein. This assay used spec...
Ligand InfoPC cidPC sid
In DepthDetails US Patent
TargetPhosphatidylinositol 4,5-bisphosphate 3-kinase catalytic subunit gamma isoform(Homo sapiens (Human))
Infinity Pharmaceuticals
US Patent
LigandPNGBDBM342468(US10329299, Compound 37 | US10675286, Compound 37 ...)
Affinity DataIC50:  3.00E+3nM. Assay description: A PI3-Kinase HTRF® assay kit (cat No. 33-016) purchased from Millipore Corporation was used to screen compounds provided herein. This assay used spec...
Ligand InfoPC cidPC sid
In DepthDetails US Patent
TargetPhosphatidylinositol 4,5-bisphosphate 3-kinase catalytic subunit delta isoform(Homo sapiens (Human))
Infinity Pharmaceuticals
US Patent
LigandPNGBDBM342468(US10329299, Compound 37 | US10675286, Compound 37 ...)
Affinity DataIC50:  4.00E+3nM. Assay description: A compound's ability in selectively inhibiting PI3K-δ can be assessed using RAJI cells, i.e., B lymphocyte cells derived from lymphoma patie...
Ligand InfoPC cidPC sid
In DepthDetails US Patent
TargetPhosphatidylinositol 4,5-bisphosphate 3-kinase catalytic subunit gamma isoform(Homo sapiens (Human))
Infinity Pharmaceuticals
US Patent
LigandPNGBDBM342468(US10329299, Compound 37 | US10675286, Compound 37 ...)
Affinity DataIC50:  5.00E+3nM. Assay description: A compound's ability in selectively inhibiting PI3K-γ can be assessed using RAW264.7 macrophages. Briefly, serum-starved RAW264.7 cells are ...
Ligand InfoPC cidPC sid
In DepthDetails US Patent
TargetPhosphatidylinositol 4,5-bisphosphate 3-kinase catalytic subunit alpha isoform(Homo sapiens (Human))
Infinity Pharmaceuticals
US Patent
LigandPNGBDBM342468(US10329299, Compound 37 | US10675286, Compound 37 ...)
Affinity DataIC50:  2.00E+3nM. Assay description: PI3 Kinase α, β, γ or δ activity was assayed using the PI3 Kinase HTRF® assay kit (catalogue No. 33-016) purchased from Millipore...
Ligand InfoPC cidPC sid
In DepthDetails US Patent
TargetPhosphatidylinositol 4,5-bisphosphate 3-kinase catalytic subunit beta isoform(Homo sapiens (Human))
Infinity Pharmaceuticals
US Patent
LigandPNGBDBM342468(US10329299, Compound 37 | US10675286, Compound 37 ...)
Affinity DataIC50:  2.00E+3nM. Assay description: PI3 Kinase α, β, γ or δ activity was assayed using the PI3 Kinase HTRF® assay kit (catalogue No. 33-016) purchased from Millipore...
Ligand InfoPC cidPC sid
In DepthDetails US Patent
TargetPhosphatidylinositol 4,5-bisphosphate 3-kinase catalytic subunit delta isoform(Homo sapiens (Human))
Infinity Pharmaceuticals
US Patent
LigandPNGBDBM342468(US10329299, Compound 37 | US10675286, Compound 37 ...)
Affinity DataIC50:  2.00E+3nM. Assay description: PI3 Kinase α, β, γ or δ activity was assayed using the PI3 Kinase HTRF® assay kit (catalogue No. 33-016) purchased from Millipore...
Ligand InfoPC cidPC sid
In DepthDetails US Patent
TargetPhosphatidylinositol 4,5-bisphosphate 3-kinase catalytic subunit beta isoform(Homo sapiens (Human))
Infinity Pharmaceuticals
US Patent
LigandPNGBDBM342468(US10329299, Compound 37 | US10675286, Compound 37 ...)
Affinity DataIC50:  2.00E+3nM. Assay description: Class I PI3-Ks can be either purchased (p110α/p85α, p110β/p85α, p110δ/p85α from Upstate, and p110γ from Sigma) or ...
Ligand InfoPC cidPC sid
In DepthDetails US Patent