BDBM342595 1-[2-(1H-indazol-5-ylmethoxy)phenyl]-3-methyl-2,5,6,7-tetrahydro-4H-isoindol-4-one::US9776990, Example 38
SMILES Cc1[nH]c(c2CCCC(=O)c12)-c1ccccc1OCc1ccc2[nH]ncc2c1
InChI Key InChIKey=OGUAWHBQCNNCJP-UHFFFAOYSA-N
Data  2 KI
  Tab Delimited (TSV)   2D SDfile   Computed 3D by Vconf -m prep SDfile
Find this compound or compounds like it in BindingDB:
Activity Spreadsheet -- Enzyme Inhibition Constant Data from BindingDB
Found 2 hits for monomerid = 342595
TargetBromodomain-containing protein 4(Homo sapiens (Human))
Abbvie
US Patent
LigandPNGBDBM342595(1-[2-(1H-indazol-5-ylmethoxy)phenyl]-3-methyl-2,5,...)
Affinity DataKi:  4.86E+3nM
Ligand InfoPC cidPC sid
In DepthDetails US Patent
TargetBromodomain-containing protein 4(Homo sapiens (Human))
Abbvie
US Patent
LigandPNGBDBM342595(1-[2-(1H-indazol-5-ylmethoxy)phenyl]-3-methyl-2,5,...)
Affinity DataKi:  4.88E+3nM. Assay description: Compound dilution series were prepared in DMSO via a 3-fold serial dilution from 2.5 mM to 42 nM. Compounds were then diluted 6:100 in assay buffer (...
Ligand InfoPC cidPC sid
In DepthDetails US Patent