BDBM342600 1-[5-amino-2-(phenylsulfanyl)phenyl]-3-methyl-2,5,6,7-tetrahydro-4H-isoindol-4-one::US9776990, Example 43
SMILES Cc1[nH]c(c2CCCC(=O)c12)-c1cc(N)ccc1Sc1ccccc1
InChI Key InChIKey=BGSQOSGWZRPTLA-UHFFFAOYSA-N
Data  2 KI
  Tab Delimited (TSV)   2D SDfile   Computed 3D by Vconf -m prep SDfile
Find this compound or compounds like it in BindingDB:
Activity Spreadsheet -- Enzyme Inhibition Constant Data from BindingDB
Found 2 hits for monomerid = 342600
TargetBromodomain-containing protein 4(Homo sapiens (Human))
Abbvie
US Patent
LigandPNGBDBM342600(1-[5-amino-2-(phenylsulfanyl)phenyl]-3-methyl-2,5,...)
Affinity DataKi:  568nM
Ligand InfoPC cidPC sid
In DepthDetails US Patent
TargetBromodomain-containing protein 4(Homo sapiens (Human))
Abbvie
US Patent
LigandPNGBDBM342600(1-[5-amino-2-(phenylsulfanyl)phenyl]-3-methyl-2,5,...)
Affinity DataKi:  1.82E+3nM. Assay description: Compound dilution series were prepared in DMSO via a 3-fold serial dilution from 2.5 mM to 42 nM. Compounds were then diluted 6:100 in assay buffer (...
Ligand InfoPC cidPC sid
In DepthDetails US Patent