BDBM342606 N′-[4-(2,4-difluorophenoxy)-3-(3-methyl-4-oxo-4,5,6,7-tetrahydro-2H-isoindol-1-yl)phenyl]-N,N-dimethylsulfuric Diamide::US9776990, Example 49
SMILES CN(C)S(=O)(=O)Nc1ccc(Oc2ccc(F)cc2F)c(c1)-c1[nH]c(C)c2c1CCCC2=O
InChI Key InChIKey=WRXGMFLVIUSNDK-UHFFFAOYSA-N
Data  2 KI
  Tab Delimited (TSV)   2D SDfile   Computed 3D by Vconf -m prep SDfile
Find this compound or compounds like it in BindingDB:
Activity Spreadsheet -- Enzyme Inhibition Constant Data from BindingDB
Found 2 hits for monomerid = 342606
TargetBromodomain-containing protein 4(Homo sapiens (Human))
Abbvie
US Patent
LigandPNGBDBM342606(N′-[4-(2,4-difluorophenoxy)-3-(3-methyl-4-ox...)
Affinity DataKi:  43nM. Assay description: Compound dilution series were prepared in DMSO via a 3-fold serial dilution from 2.5 mM to 42 nM. Compounds were then diluted 6:100 in assay buffer (...
Ligand InfoPC cidPC sid
In DepthDetails US Patent
TargetBromodomain-containing protein 4(Homo sapiens (Human))
Abbvie
US Patent
LigandPNGBDBM342606(N′-[4-(2,4-difluorophenoxy)-3-(3-methyl-4-ox...)
Affinity DataKi:  192nM
Ligand InfoPC cidPC sid
In DepthDetails US Patent