BDBM342629 N-[3-(3-methyl-4-oxo-6-phenyl-4,5,6,7-tetrahydro-2H-isoindol-1-yl)-4-phenoxyphenyl]methanesulfonamide::US9776990, Example 72
SMILES Cc1[nH]c(c2CC(CC(=O)c12)c1ccccc1)-c1cc(NS(C)(=O)=O)ccc1Oc1ccccc1
InChI Key
Data  2 KI
  Tab Delimited (TSV)   2D SDfile   Computed 3D by Vconf -m prep SDfile
Find this compound or compounds like it in BindingDB:
Activity Spreadsheet -- Enzyme Inhibition Constant Data from BindingDB
Found 2 hits for monomerid = 342629
TargetBromodomain-containing protein 4(Homo sapiens (Human))
Abbvie
US Patent
LigandPNGBDBM342629(N-[3-(3-methyl-4-oxo-6-phenyl-4,5,6,7-tetrahydro-2...)
Affinity DataKi:  7.28E+3nM. Assay description: Compound dilution series were prepared in DMSO via a 3-fold serial dilution from 2.5 mM to 42 nM. Compounds were then diluted 6:100 in assay buffer (...
Ligand InfoPC cidPC sid
In DepthDetails US Patent
TargetBromodomain-containing protein 4(Homo sapiens (Human))
Abbvie
US Patent
LigandPNGBDBM342629(N-[3-(3-methyl-4-oxo-6-phenyl-4,5,6,7-tetrahydro-2...)
Affinity DataKi:  2.22E+4nM
Ligand InfoPC cidPC sid
In DepthDetails US Patent