BDBM342648 5-[4-(4-Bromo-thiophene-3-carbonyl)-piperazin-1-ylmethyl]-thiophene-2-carboxylic acid 2-trifluoromethyl-benzylamide::US9776991, Example 18
SMILES FC(F)(F)c1ccccc1CNC(=O)c1ccc(CN2CCN(CC2)C(=O)c2cscc2Br)s1
InChI Key InChIKey=JPSVEUXWSSWNDW-UHFFFAOYSA-N
Data  1 IC50
  Tab Delimited (TSV)   2D SDfile   Computed 3D by Vconf -m prep SDfile
Find this compound or compounds like it in BindingDB:
Activity Spreadsheet -- Enzyme Inhibition Constant Data from BindingDB
Found 1 hit for monomerid = 342648
TargetBifunctional epoxide hydrolase 2(Homo sapiens (Human))
Sanofi
US Patent
LigandPNGBDBM342648(5-[4-(4-Bromo-thiophene-3-carbonyl)-piperazin-1-yl...)
Affinity DataIC50:  0.678nM. Assay description: Compounds were tested in a biochemical screening assay using recombinant sEH purified from Sf9 insect cells and an artificial substrate, (3-phenyl-ox...
Ligand InfoPC cidPC sid
In DepthDetails US Patent