BDBM343110 1-(5'-chloro-2',5-dimethoxy-2-methyl-4-biphenylyl)-N-3-isoxazolyl-6-isoquinolinesulfonamide::US9776995, Example 281
SMILES COc1ccc(Cl)cc1-c1cc(OC)c(cc1C)-c1nccc2cc(ccc12)S(=O)(=O)Nc1ccon1
InChI Key InChIKey=IAUGIXQYAFRSEQ-UHFFFAOYSA-N
Data  1 IC50
  Tab Delimited (TSV)   2D SDfile   Computed 3D by Vconf -m prep SDfile
Find this compound or compounds like it in BindingDB:
Activity Spreadsheet -- Enzyme Inhibition Constant Data from BindingDB
Found 1 hit for monomerid = 343110
TargetSodium channel protein type 9 subunit alpha(Homo sapiens (Human))
Amgen
US Patent
LigandPNGBDBM343110(1-(5'-chloro-2',5-dimethoxy-2-methyl-4-biphenylyl)...)
Affinity DataIC50:  16.4nM. Assay description: HEK 293 cells stably transfected with human Nav1.7 were recorded in whole cell voltage clamp mode with the PatchXpress automated electrophysiology sy...
Ligand InfoPC cidPC sid
In DepthDetails US Patent