BDBM343242 4-(4-(difluoromethyl)-5-methylthiazol-2-yl)-1-methyl-N-(2-phenyl-5,6,7,8-tetrahydroimidazo[1,2-a]pyridin-7-yl)-1H-pyrazole-5-carboxamide::US9777000, Example 2.6
SMILES Cc1sc(nc1C(F)F)-c1cnn(C)c1C(=O)NC1CCn2cc(nc2C1)-c1ccccc1
InChI Key InChIKey=LMISMSCDPMYLGD-UHFFFAOYSA-N
Data  1 IC50
  Tab Delimited (TSV)   2D SDfile   Computed 3D by Vconf -m prep SDfile
Find this compound or compounds like it in BindingDB:
Activity Spreadsheet -- Enzyme Inhibition Constant Data from BindingDB
Found 1 hit for monomerid = 343242
TargetcAMP and cAMP-inhibited cGMP 3',5'-cyclic phosphodiesterase 10A(Homo sapiens (Human))
Mochida Pharmaceutical
US Patent
LigandPNGBDBM343242(4-(4-(difluoromethyl)-5-methylthiazol-2-yl)-1-meth...)
Affinity DataIC50: <5nM. Assay description: IMAP TR-FRET Phosphodiersterase Evaluation Assay Kit (Molecular Device) was used for the measurement. Ten μL of a diluted test compound having e...
Ligand InfoPC cidPC sid
In DepthDetails US Patent