BDBM343365 4-(5-(2-ethoxyethyl)-4-methylthiazol-2-yl)-1-methyl-N-(2-phenyl-5,6,7,8-tetrahydro-[1,2,4]triazolo[1,5-a]pyridin-7-yl)-1H-pyrazole-5-carboxamide::US9777000, Example 5.11
SMILES CCOCCc1sc(nc1C)-c1cnn(C)c1C(=O)NC1CCn2nc(nc2C1)-c1ccccc1
InChI Key InChIKey=HGPATJRUXDZOHK-UHFFFAOYSA-N
Data  1 IC50
  Tab Delimited (TSV)   2D SDfile   Computed 3D by Vconf -m prep SDfile
Find this compound or compounds like it in BindingDB:
Activity Spreadsheet -- Enzyme Inhibition Constant Data from BindingDB
Found 1 hit for monomerid = 343365
TargetcAMP and cAMP-inhibited cGMP 3',5'-cyclic phosphodiesterase 10A(Homo sapiens (Human))
Mochida Pharmaceutical
US Patent
LigandPNGBDBM343365(4-(5-(2-ethoxyethyl)-4-methylthiazol-2-yl)-1-methy...)
Affinity DataIC50:  52nM. Assay description: IMAP TR-FRET Phosphodiersterase Evaluation Assay Kit (Molecular Device) was used for the measurement. Ten μL of a diluted test compound having e...
Ligand InfoPC cidPC sid
In DepthDetails US Patent