BDBM343396 4-(5-cyclopropyl-4-(difluoromethyl)thiazol-2-yl)-N-(2-(3-fluorophenyl)-5,6,7,8-tetrahydro-[1,2,4]triazolo[1,5-a]pyridin-7-yl)-1-methyl-1H-pyrazole-5-carboxamide::US9777000, Example 5.42
SMILES Cn1ncc(-c2nc(C(F)F)c(s2)C2CC2)c1C(=O)NC1CCn2nc(nc2C1)-c1cccc(F)c1
InChI Key InChIKey=PAMJNKQBICFYEJ-UHFFFAOYSA-N
Data  1 IC50
  Tab Delimited (TSV)   2D SDfile   Computed 3D by Vconf -m prep SDfile
Find this compound or compounds like it in BindingDB:
Activity Spreadsheet -- Enzyme Inhibition Constant Data from BindingDB
Found 1 hit for monomerid = 343396
TargetcAMP and cAMP-inhibited cGMP 3',5'-cyclic phosphodiesterase 10A(Homo sapiens (Human))
Mochida Pharmaceutical
US Patent
LigandPNGBDBM343396(4-(5-cyclopropyl-4-(difluoromethyl)thiazol-2-yl)-N...)
Affinity DataIC50:  52nM. Assay description: IMAP TR-FRET Phosphodiersterase Evaluation Assay Kit (Molecular Device) was used for the measurement. Ten μL of a diluted test compound having e...
Ligand InfoPC cidPC sid
In DepthDetails US Patent