BDBM343532 US10442803, Example 131::US11091484, Example 131::US9777003, Example 131
SMILES CNC(=O)c1cc2c(ccc3nnc(C)n23)n1Cc1cc(Cl)cc(CN2CCC2)c1
InChI Key InChIKey=MUHKMBITBREDKY-UHFFFAOYSA-N
Data  6 IC50
  Tab Delimited (TSV)   2D SDfile   Computed 3D by Vconf -m prep SDfile
Find this compound or compounds like it in BindingDB:
Activity Spreadsheet -- Enzyme Inhibition Constant Data from BindingDB
Found 6 hits for monomerid = 343532
TargetBromodomain-containing protein 4 [42-168](Homo sapiens (Human))
Incyte
US Patent
LigandPNGBDBM343532(US10442803, Example 131 | US11091484, Example 131 ...)
Affinity DataIC50: <100nM. Assay description: BRD4-BD1 and BRD4-BD2 assays were conducted in white 384-well polystyrene plate in a final volume of 20 μL for BD1 and 40 μL for BD2. Inhib...
Ligand InfoPC cidPC sid
In DepthDetails US Patent
TargetBromodomain-containing protein 4 [342-460](Homo sapiens (Human))
Incyte
US Patent
LigandPNGBDBM343532(US10442803, Example 131 | US11091484, Example 131 ...)
Affinity DataIC50: <100nM. Assay description: BRD4-BD1 and BRD4-BD2 assays were conducted in white 384-well polystyrene plate in a final volume of 20 μL for BD1 and 40 μL for BD2. Inhib...
Ligand InfoPC cidPC sid
In DepthDetails US Patent
TargetBromodomain-containing protein 4 [368-440](Homo sapiens (Human))
Incyte
US Patent
LigandPNGBDBM343532(US10442803, Example 131 | US11091484, Example 131 ...)
Affinity DataIC50: <100nM
Ligand InfoPC cidPC sid
In DepthDetails US Patent
TargetBromodomain-containing protein 4 [342-460](Homo sapiens (Human))
Incyte
US Patent
LigandPNGBDBM343532(US10442803, Example 131 | US11091484, Example 131 ...)
Affinity DataIC50: <1.00E+3nM. Assay description: BRD4-BD1 and BRD4-BD2 assays were conducted in white 384-well polystyrene plate in a final volume of 20 μL for BD1 and 40 μL for BD2. Inhib...
Ligand InfoPC cidPC sid
In DepthDetails US Patent
TargetBromodomain-containing protein 4 [75-147](Homo sapiens (Human))
Incyte
US Patent
LigandPNGBDBM343532(US10442803, Example 131 | US11091484, Example 131 ...)
Affinity DataIC50: <100nM. Assay description: BRD4-BD1 and BRD4-BD2 assays were conducted in white 384-well polystyrene plate in a final volume of 20 μL for BD1 and 40 μL for BD2. Inhib...
Ligand InfoPC cidPC sid
In DepthDetails US Patent
TargetBromodomain-containing protein 4 [42-168](Homo sapiens (Human))
Incyte
US Patent
LigandPNGBDBM343532(US10442803, Example 131 | US11091484, Example 131 ...)
Affinity DataIC50: <1.00E+3nM. Assay description: BRD4-BD1 and BRD4-BD2 assays were conducted in white 384-well polystyrene plate in a final volume of 20 μL for BD1 and 40 μL for BD2. Inhib...
Ligand InfoPC cidPC sid
In DepthDetails US Patent