BDBM343668 N-(6-Benzyl-1,7-dimethyl-6H-pyrrolo[2,3- e][1,2,4]triazolo[4,3-a]pyridin-4- yl)propionamide::US10442803, Example 268::US11091484, Example 268::US9777003, Example 268
SMILES CCC(=O)Nc1cc2n(Cc3ccccc3)c(C)cc2n2c(C)nnc12
InChI Key InChIKey=RQCXVBAPFBLGIM-UHFFFAOYSA-N
Data  6 IC50
  Tab Delimited (TSV)   2D SDfile   Computed 3D by Vconf -m prep SDfile
Find this compound or compounds like it in BindingDB:
Activity Spreadsheet -- Enzyme Inhibition Constant Data from BindingDB
Found 6 hits for monomerid = 343668
TargetBromodomain-containing protein 4 [42-168](Homo sapiens (Human))
Incyte
US Patent
LigandPNGBDBM343668(N-(6-Benzyl-1,7-dimethyl-6H-pyrrolo[2,3- e][1,2,4]...)
Affinity DataIC50: <100nM. Assay description: BRD4-BD1 and BRD4-BD2 assays were conducted in white 384-well polystyrene plate in a final volume of 20 μL for BD1 and 40 μL for BD2. Inhib...
Ligand InfoPC cidPC sid
In DepthDetails US Patent
TargetBromodomain-containing protein 4 [342-460](Homo sapiens (Human))
Incyte
US Patent
LigandPNGBDBM343668(N-(6-Benzyl-1,7-dimethyl-6H-pyrrolo[2,3- e][1,2,4]...)
Affinity DataIC50: <100nM. Assay description: BRD4-BD1 and BRD4-BD2 assays were conducted in white 384-well polystyrene plate in a final volume of 20 μL for BD1 and 40 μL for BD2. Inhib...
Ligand InfoPC cidPC sid
In DepthDetails US Patent
TargetBromodomain-containing protein 4 [368-440](Homo sapiens (Human))
Incyte
US Patent
LigandPNGBDBM343668(N-(6-Benzyl-1,7-dimethyl-6H-pyrrolo[2,3- e][1,2,4]...)
Affinity DataIC50: <100nM
Ligand InfoPC cidPC sid
In DepthDetails US Patent
TargetBromodomain-containing protein 4 [42-168](Homo sapiens (Human))
Incyte
US Patent
LigandPNGBDBM343668(N-(6-Benzyl-1,7-dimethyl-6H-pyrrolo[2,3- e][1,2,4]...)
Affinity DataIC50: <1.00E+3nM. Assay description: BRD4-BD1 and BRD4-BD2 assays were conducted in white 384-well polystyrene plate in a final volume of 20 μL for BD1 and 40 μL for BD2. Inhib...
Ligand InfoPC cidPC sid
In DepthDetails US Patent
TargetBromodomain-containing protein 4 [75-147](Homo sapiens (Human))
Incyte
US Patent
LigandPNGBDBM343668(N-(6-Benzyl-1,7-dimethyl-6H-pyrrolo[2,3- e][1,2,4]...)
Affinity DataIC50: <100nM. Assay description: BRD4-BD1 and BRD4-BD2 assays were conducted in white 384-well polystyrene plate in a final volume of 20 μL for BD1 and 40 μL for BD2. Inhib...
Ligand InfoPC cidPC sid
In DepthDetails US Patent
TargetBromodomain-containing protein 4 [342-460](Homo sapiens (Human))
Incyte
US Patent
LigandPNGBDBM343668(N-(6-Benzyl-1,7-dimethyl-6H-pyrrolo[2,3- e][1,2,4]...)
Affinity DataIC50: <1.00E+3nM. Assay description: BRD4-BD1 and BRD4-BD2 assays were conducted in white 384-well polystyrene plate in a final volume of 20 μL for BD1 and 40 μL for BD2. Inhib...
Ligand InfoPC cidPC sid
In DepthDetails US Patent